13. enero 2012 · Comentarios desactivados · Categories: errores, jdeveloper, weblogic
Entorno: JDeveloper sobre Ubuntu Traza del error: <...7:43:58 PM CET> <Critical> <WebLogicServer> <BEA-000362> <Server failed. Reason: There are 1 nested errors: java.lang.ClassCastException: com.octetstring.vde.backend.BackendRoot cannot be cast to com.octetstring.vde.backend.standard.BackendStandard at weblogic.ldap.EmbeddedLDAP.start(EmbeddedLDAP.java:303) at weblogic.t3.srvr.SubsystemRequest.run(SubsystemRequest.java:64) at...
21. diciembre 2011 · Comentarios desactivados · Categories: errores, maven
[INFO] Copying artifact[ejb:com.cliente.proyecto.ejb:ejbNegocio:1.5-SNAPSHOT] to[EJBNegocio.jar] [INFO] ------------------------------------------------------------------------ [ERROR] BUILD ERROR [INFO] ------------------------------------------------------------------------ [INFO] Cannot copy a directory: D:\desarrollo\proyectos\proyecto\branch\testweb\target\classes; Did you package/install active project artifact: artifact = active project artifact: artifact =...
30. agosto 2011 · Comentarios desactivados · Categories: errores
Creando una consulta de base de datos desde Excel, contra una vista en DB2 me daba un error SQL0206N SQLSTATE=42703. Resulta que DB2 como cualquier otra base de datos, cuando se le da a una columna un nombre con caracteres especiales (Ejemplo el espacio), hay que entrecomillarlo para que lo sepa interpretar, si se toma por norma esto, al hacerlo sobre nombres simples, parece que las comillas las interpreta como parte del nombre, aunque desde el toad no se vean. Entonces, la solución es...
29. julio 2011 · Comentarios desactivados · Categories: errores
------------------------------------------------------- T E S T S ------------------------------------------------------- Running edu.emmerson.test.sonar.comunicacion.comun.basicos.ElementoTest Tests run: 9, Failures: 0, Errors: 0, Skipped: 0, Time elapsed: 0.097 sec Results : Tests run: 9, Failures: 0, Errors: 0, Skipped: 0 [INFO] ------------------------------------------------------------------------ [INFO] Building MultiModulo - Comun [INFO] task-segment: [sonar:sonar,...
24. julio 2011 · Comentarios desactivados · Categories: ADF, errores, jdeveloper
Lo primero, este tipo de fallos sale cuando se desarrolla con ADF + JDeveloper, en este caso 11g. Después de cambiar los nombres de las configuraciones de un módulo de aplicación en el proyecto model, al volver a ejecutar la aplicación dió el siguiente mensaje de error: <Utils><buildFacesMessage> ADF: Adding the following JSF error message: Configuration AppModuleLocal is not found. oracle.jbo.ConfigException: JBO-33005: Configuration AppModuleLocal is not found. at...
20. julio 2011 · Comentarios desactivados · Categories: ant, errores
Compilando con ant (javac task) me da un mensaje de warning y el compilador se me queda como ejecutandose (cuadradito rojo del eclipse), pero trabado. Mensaje de ant: "warning: unmappable character for encoding UTF8" Esto se debe a que el el compilador no reconoce el juego de caracteres del fichero de código fuente. Soluciones: Cambiar el juego de caracteres del ficheroEjecutar la tarea javac con el argumento encoding="ISO-8859-1" o el juego de caracteres en que se sospeche esta el fichero....